Build failed in Jenkins: Aries-Tx-Control-Trunk-JDK8 #67

classic Classic list List threaded Threaded
4 messages Options
Reply | Threaded
Open this post in threaded view
|

Build failed in Jenkins: Aries-Tx-Control-Trunk-JDK8 #67

Apache Jenkins Server-2
See <https://builds.apache.org/job/Aries-Tx-Control-Trunk-JDK8/67/display/redirect?page=changes>

Changes:

[timothyjward] [ARIES Tx Control 1.0.0 maven-release-plugin]prepare release 1.0.0

[timothyjward] [ARIES Tx Control 1.0.0 maven-release-plugin]prepare for next

------------------------------------------
Started by an SCM change
Started by an SCM change
[EnvInject] - Loading node environment variables.
Building remotely on H29 (ubuntu xenial) in workspace <https://builds.apache.org/job/Aries-Tx-Control-Trunk-JDK8/ws/>
Cloning the remote Git repository
Cloning repository https://gitbox.apache.org/repos/asf/aries-tx-control.git
 > git init <https://builds.apache.org/job/Aries-Tx-Control-Trunk-JDK8/ws/> # timeout=10
Fetching upstream changes from https://gitbox.apache.org/repos/asf/aries-tx-control.git
 > git --version # timeout=10
 > git fetch --tags --progress https://gitbox.apache.org/repos/asf/aries-tx-control.git +refs/heads/*:refs/remotes/origin/*
 > git config remote.origin.url https://gitbox.apache.org/repos/asf/aries-tx-control.git # timeout=10
 > git config --add remote.origin.fetch +refs/heads/*:refs/remotes/origin/* # timeout=10
 > git config remote.origin.url https://gitbox.apache.org/repos/asf/aries-tx-control.git # timeout=10
Fetching upstream changes from https://gitbox.apache.org/repos/asf/aries-tx-control.git
 > git fetch --tags --progress https://gitbox.apache.org/repos/asf/aries-tx-control.git +refs/heads/*:refs/remotes/origin/*
 > git rev-parse refs/remotes/origin/master^{commit} # timeout=10
 > git rev-parse refs/remotes/origin/origin/master^{commit} # timeout=10
Checking out Revision f7cd89eb49a99df841c3ab9c217dd678d5a18121 (refs/remotes/origin/master)
 > git config core.sparsecheckout # timeout=10
 > git checkout -f f7cd89eb49a99df841c3ab9c217dd678d5a18121
Commit message: "[ARIES Tx Control 1.0.0 maven-release-plugin]prepare for next development iteration"
 > git rev-list --no-walk 44f72ca4f03410f7e5fc676522545461efd90ed7 # timeout=10
Parsing POMs
ERROR: Failed to parse POMs
java.io.IOException: remote file operation failed: <https://builds.apache.org/job/Aries-Tx-Control-Trunk-JDK8/ws/> at hudson.remoting.Channel@315d26fd:H29: hudson.remoting.ProxyException: hudson.maven.MavenModuleSetBuild$MavenExecutionException: org.apache.maven.project.ProjectBuildingException: Some problems were encountered while processing the POMs:
[FATAL] Non-resolvable parent POM: Could not find artifact org.apache.aries.tx-control:tx-control-parent:pom:1.0.1-SNAPSHOT and 'parent.relativePath' points at wrong local POM @ line 22, column 10

        at hudson.FilePath.act(FilePath.java:993)
        at hudson.FilePath.act(FilePath.java:975)
        at hudson.maven.MavenModuleSetBuild$MavenModuleSetBuildExecution.parsePoms(MavenModuleSetBuild.java:986)
        at hudson.maven.MavenModuleSetBuild$MavenModuleSetBuildExecution.doRun(MavenModuleSetBuild.java:691)
        at hudson.model.AbstractBuild$AbstractBuildExecution.run(AbstractBuild.java:504)
        at hudson.model.Run.execute(Run.java:1724)
        at hudson.maven.MavenModuleSetBuild.run(MavenModuleSetBuild.java:543)
        at hudson.model.ResourceController.execute(ResourceController.java:97)
        at hudson.model.Executor.run(Executor.java:429)
Caused by: hudson.remoting.ProxyException: hudson.maven.MavenModuleSetBuild$MavenExecutionException: org.apache.maven.project.ProjectBuildingException: Some problems were encountered while processing the POMs:
[FATAL] Non-resolvable parent POM: Could not find artifact org.apache.aries.tx-control:tx-control-parent:pom:1.0.1-SNAPSHOT and 'parent.relativePath' points at wrong local POM @ line 22, column 10

        at hudson.maven.MavenModuleSetBuild$PomParser.invoke(MavenModuleSetBuild.java:1391)
        at hudson.maven.MavenModuleSetBuild$PomParser.invoke(MavenModuleSetBuild.java:1125)
        at hudson.FilePath$FileCallableWrapper.call(FilePath.java:2760)
        at hudson.remoting.UserRequest.perform(UserRequest.java:207)
        at hudson.remoting.UserRequest.perform(UserRequest.java:53)
        at hudson.remoting.Request$2.run(Request.java:358)
        at hudson.remoting.InterceptingExecutorService$1.call(InterceptingExecutorService.java:72)
        at java.util.concurrent.FutureTask.run(FutureTask.java:266)
        at java.util.concurrent.ThreadPoolExecutor.runWorker(ThreadPoolExecutor.java:1142)
        at java.util.concurrent.ThreadPoolExecutor$Worker.run(ThreadPoolExecutor.java:617)
        at java.lang.Thread.run(Thread.java:748)
        Suppressed: hudson.remoting.Channel$CallSiteStackTrace: Remote call to H29
                at hudson.remoting.Channel.attachCallSiteStackTrace(Channel.java:1693)
                at hudson.remoting.UserResponse.retrieve(UserRequest.java:310)
                at hudson.remoting.Channel.call(Channel.java:908)
                at hudson.FilePath.act(FilePath.java:986)
                at hudson.FilePath.act(FilePath.java:975)
                at hudson.maven.MavenModuleSetBuild$MavenModuleSetBuildExecution.parsePoms(MavenModuleSetBuild.java:986)
                at hudson.maven.MavenModuleSetBuild$MavenModuleSetBuildExecution.doRun(MavenModuleSetBuild.java:691)
                at hudson.model.AbstractBuild$AbstractBuildExecution.run(AbstractBuild.java:504)
                at hudson.model.Run.execute(Run.java:1724)
                at hudson.maven.MavenModuleSetBuild.run(MavenModuleSetBuild.java:543)
                at hudson.model.ResourceController.execute(ResourceController.java:97)
                at hudson.model.Executor.run(Executor.java:429)
Caused by: hudson.remoting.ProxyException: org.apache.maven.project.ProjectBuildingException: Some problems were encountered while processing the POMs:
[FATAL] Non-resolvable parent POM: Could not find artifact org.apache.aries.tx-control:tx-control-parent:pom:1.0.1-SNAPSHOT and 'parent.relativePath' points at wrong local POM @ line 22, column 10

        at org.apache.maven.project.DefaultProjectBuilder.build(DefaultProjectBuilder.java:364)
        at hudson.maven.MavenEmbedder.buildProjects(MavenEmbedder.java:361)
        at hudson.maven.MavenEmbedder.readProjects(MavenEmbedder.java:331)
        at hudson.maven.MavenModuleSetBuild$PomParser.invoke(MavenModuleSetBuild.java:1328)
        ... 10 more
Reply | Threaded
Open this post in threaded view
|

Build failed in Jenkins: Aries-Tx-Control-Trunk-JDK8 #68

Apache Jenkins Server-2
See <https://builds.apache.org/job/Aries-Tx-Control-Trunk-JDK8/68/display/redirect?page=changes>

Changes:

[timothyjward] Speed up the JPA integration tests

[timothyjward] Add integration test for OpenJPA 3.0.0

------------------------------------------
Started by an SCM change
Started by an SCM change
[EnvInject] - Loading node environment variables.
Building remotely on ubuntu-1 (ubuntu trusty) in workspace <https://builds.apache.org/job/Aries-Tx-Control-Trunk-JDK8/ws/>
Cloning the remote Git repository
Cloning repository https://gitbox.apache.org/repos/asf/aries-tx-control.git
 > git init <https://builds.apache.org/job/Aries-Tx-Control-Trunk-JDK8/ws/> # timeout=10
Fetching upstream changes from https://gitbox.apache.org/repos/asf/aries-tx-control.git
 > git --version # timeout=10
 > git fetch --tags --progress https://gitbox.apache.org/repos/asf/aries-tx-control.git +refs/heads/*:refs/remotes/origin/*
 > git config remote.origin.url https://gitbox.apache.org/repos/asf/aries-tx-control.git # timeout=10
 > git config --add remote.origin.fetch +refs/heads/*:refs/remotes/origin/* # timeout=10
 > git config remote.origin.url https://gitbox.apache.org/repos/asf/aries-tx-control.git # timeout=10
Fetching upstream changes from https://gitbox.apache.org/repos/asf/aries-tx-control.git
 > git fetch --tags --progress https://gitbox.apache.org/repos/asf/aries-tx-control.git +refs/heads/*:refs/remotes/origin/*
 > git rev-parse refs/remotes/origin/master^{commit} # timeout=10
 > git rev-parse refs/remotes/origin/origin/master^{commit} # timeout=10
Checking out Revision 4c825206e55e87cf96b0fe00c1fd4f69ecf4488c (refs/remotes/origin/master)
 > git config core.sparsecheckout # timeout=10
 > git checkout -f 4c825206e55e87cf96b0fe00c1fd4f69ecf4488c
Commit message: "Add integration test for OpenJPA 3.0.0"
 > git rev-list --no-walk f7cd89eb49a99df841c3ab9c217dd678d5a18121 # timeout=10
Parsing POMs
ERROR: Failed to parse POMs
hudson.remoting.ProxyException: hudson.maven.MavenModuleSetBuild$MavenExecutionException: org.apache.maven.project.ProjectBuildingException: Some problems were encountered while processing the POMs:
[FATAL] Non-resolvable parent POM: Could not find artifact org.apache.aries.tx-control:tx-control-parent:pom:1.0.1-SNAPSHOT and 'parent.relativePath' points at wrong local POM @ line 22, column 10

        at hudson.maven.MavenModuleSetBuild$PomParser.invoke(MavenModuleSetBuild.java:1391)
        at hudson.maven.MavenModuleSetBuild$PomParser.invoke(MavenModuleSetBuild.java:1125)
        at hudson.FilePath$FileCallableWrapper.call(FilePath.java:3086)
        at hudson.remoting.UserRequest.perform(UserRequest.java:212)
        at hudson.remoting.UserRequest.perform(UserRequest.java:54)
        at hudson.remoting.Request$2.run(Request.java:369)
        at hudson.remoting.InterceptingExecutorService$1.call(InterceptingExecutorService.java:72)
        at java.util.concurrent.FutureTask.run(FutureTask.java:266)
        at java.util.concurrent.ThreadPoolExecutor.runWorker(ThreadPoolExecutor.java:1142)
        at java.util.concurrent.ThreadPoolExecutor$Worker.run(ThreadPoolExecutor.java:617)
        at java.lang.Thread.run(Thread.java:748)
        Suppressed: hudson.remoting.Channel$CallSiteStackTrace: Remote call to ubuntu-1
                at hudson.remoting.Channel.attachCallSiteStackTrace(Channel.java:1741)
                at hudson.remoting.UserRequest$ExceptionResponse.retrieve(UserRequest.java:357)
                at hudson.remoting.Channel.call(Channel.java:955)
                at hudson.FilePath.act(FilePath.java:1072)
                at hudson.FilePath.act(FilePath.java:1061)
                at hudson.maven.MavenModuleSetBuild$MavenModuleSetBuildExecution.parsePoms(MavenModuleSetBuild.java:986)
                at hudson.maven.MavenModuleSetBuild$MavenModuleSetBuildExecution.doRun(MavenModuleSetBuild.java:691)
                at hudson.model.AbstractBuild$AbstractBuildExecution.run(AbstractBuild.java:504)
                at hudson.model.Run.execute(Run.java:1810)
                at hudson.maven.MavenModuleSetBuild.run(MavenModuleSetBuild.java:543)
                at hudson.model.ResourceController.execute(ResourceController.java:97)
                at hudson.model.Executor.run(Executor.java:429)
Caused by: hudson.remoting.ProxyException: org.apache.maven.project.ProjectBuildingException: Some problems were encountered while processing the POMs:
[FATAL] Non-resolvable parent POM: Could not find artifact org.apache.aries.tx-control:tx-control-parent:pom:1.0.1-SNAPSHOT and 'parent.relativePath' points at wrong local POM @ line 22, column 10

        at org.apache.maven.project.DefaultProjectBuilder.build(DefaultProjectBuilder.java:364)
        at hudson.maven.MavenEmbedder.buildProjects(MavenEmbedder.java:361)
        at hudson.maven.MavenEmbedder.readProjects(MavenEmbedder.java:331)
        at hudson.maven.MavenModuleSetBuild$PomParser.invoke(MavenModuleSetBuild.java:1328)
        ... 10 more
Reply | Threaded
Open this post in threaded view
|

Build failed in Jenkins: Aries-Tx-Control-Trunk-JDK8 #69

Apache Jenkins Server-2
See <https://builds.apache.org/job/Aries-Tx-Control-Trunk-JDK8/69/display/redirect?page=changes>

Changes:

[timothyjward] Add integration test for OpenJPA 3.0.0 with XA transactions

------------------------------------------
Started by an SCM change
[EnvInject] - Loading node environment variables.
Building remotely on ubuntu-1 (ubuntu trusty) in workspace <https://builds.apache.org/job/Aries-Tx-Control-Trunk-JDK8/ws/>
 > git rev-parse --is-inside-work-tree # timeout=10
Fetching changes from the remote Git repository
 > git config remote.origin.url https://gitbox.apache.org/repos/asf/aries-tx-control.git # timeout=10
Fetching upstream changes from https://gitbox.apache.org/repos/asf/aries-tx-control.git
 > git --version # timeout=10
 > git fetch --tags --progress https://gitbox.apache.org/repos/asf/aries-tx-control.git +refs/heads/*:refs/remotes/origin/*
 > git rev-parse refs/remotes/origin/master^{commit} # timeout=10
 > git rev-parse refs/remotes/origin/origin/master^{commit} # timeout=10
Checking out Revision acf0b4ad6cced73aae32122340bd2f419ff7ad10 (refs/remotes/origin/master)
 > git config core.sparsecheckout # timeout=10
 > git checkout -f acf0b4ad6cced73aae32122340bd2f419ff7ad10
Commit message: "Add integration test for OpenJPA 3.0.0 with XA transactions"
 > git rev-list --no-walk 4c825206e55e87cf96b0fe00c1fd4f69ecf4488c # timeout=10
Parsing POMs
ERROR: Failed to parse POMs
hudson.remoting.ProxyException: hudson.maven.MavenModuleSetBuild$MavenExecutionException: org.apache.maven.project.ProjectBuildingException: Some problems were encountered while processing the POMs:
[FATAL] Non-resolvable parent POM: Could not find artifact org.apache.aries.tx-control:tx-control-parent:pom:1.0.1-SNAPSHOT and 'parent.relativePath' points at wrong local POM @ line 22, column 10

        at hudson.maven.MavenModuleSetBuild$PomParser.invoke(MavenModuleSetBuild.java:1391)
        at hudson.maven.MavenModuleSetBuild$PomParser.invoke(MavenModuleSetBuild.java:1125)
        at hudson.FilePath$FileCallableWrapper.call(FilePath.java:3086)
        at hudson.remoting.UserRequest.perform(UserRequest.java:212)
        at hudson.remoting.UserRequest.perform(UserRequest.java:54)
        at hudson.remoting.Request$2.run(Request.java:369)
        at hudson.remoting.InterceptingExecutorService$1.call(InterceptingExecutorService.java:72)
        at java.util.concurrent.FutureTask.run(FutureTask.java:266)
        at java.util.concurrent.ThreadPoolExecutor.runWorker(ThreadPoolExecutor.java:1142)
        at java.util.concurrent.ThreadPoolExecutor$Worker.run(ThreadPoolExecutor.java:617)
        at java.lang.Thread.run(Thread.java:748)
        Suppressed: hudson.remoting.Channel$CallSiteStackTrace: Remote call to ubuntu-1
                at hudson.remoting.Channel.attachCallSiteStackTrace(Channel.java:1741)
                at hudson.remoting.UserRequest$ExceptionResponse.retrieve(UserRequest.java:357)
                at hudson.remoting.Channel.call(Channel.java:955)
                at hudson.FilePath.act(FilePath.java:1072)
                at hudson.FilePath.act(FilePath.java:1061)
                at hudson.maven.MavenModuleSetBuild$MavenModuleSetBuildExecution.parsePoms(MavenModuleSetBuild.java:986)
                at hudson.maven.MavenModuleSetBuild$MavenModuleSetBuildExecution.doRun(MavenModuleSetBuild.java:691)
                at hudson.model.AbstractBuild$AbstractBuildExecution.run(AbstractBuild.java:504)
                at hudson.model.Run.execute(Run.java:1810)
                at hudson.maven.MavenModuleSetBuild.run(MavenModuleSetBuild.java:543)
                at hudson.model.ResourceController.execute(ResourceController.java:97)
                at hudson.model.Executor.run(Executor.java:429)
Caused by: hudson.remoting.ProxyException: org.apache.maven.project.ProjectBuildingException: Some problems were encountered while processing the POMs:
[FATAL] Non-resolvable parent POM: Could not find artifact org.apache.aries.tx-control:tx-control-parent:pom:1.0.1-SNAPSHOT and 'parent.relativePath' points at wrong local POM @ line 22, column 10

        at org.apache.maven.project.DefaultProjectBuilder.build(DefaultProjectBuilder.java:364)
        at hudson.maven.MavenEmbedder.buildProjects(MavenEmbedder.java:361)
        at hudson.maven.MavenEmbedder.readProjects(MavenEmbedder.java:331)
        at hudson.maven.MavenModuleSetBuild$PomParser.invoke(MavenModuleSetBuild.java:1328)
        ... 10 more
Reply | Threaded
Open this post in threaded view
|

Jenkins build is back to normal : Aries-Tx-Control-Trunk-JDK8 #70

Apache Jenkins Server-2