[jira] [Resolved] (ARIES-1836) Test failure in TestFastbinRoundTrip: SocketException: Invalid argument

classic Classic list List threaded Threaded
1 message Options
Reply | Threaded
Open this post in threaded view
|

[jira] [Resolved] (ARIES-1836) Test failure in TestFastbinRoundTrip: SocketException: Invalid argument

ASF subversion and git services (Jira)

     [ https://issues.apache.org/jira/browse/ARIES-1836?page=com.atlassian.jira.plugin.system.issuetabpanels:all-tabpanel ]

Christian Schneider resolved ARIES-1836.
----------------------------------------
      Assignee: Christian Schneider
    Resolution: Cannot Reproduce

I can not reproduce test failures anymore. All recent builds succeeded.

> Test failure in TestFastbinRoundTrip: SocketException: Invalid argument
> -----------------------------------------------------------------------
>
>                 Key: ARIES-1836
>                 URL: https://issues.apache.org/jira/browse/ARIES-1836
>             Project: Aries
>          Issue Type: Test
>          Components: Remote Service Admin
>    Affects Versions: rsa-1.12.0
>            Reporter: Christian Schneider
>            Assignee: Christian Schneider
>            Priority: Major
>             Fix For: rsa-1.15.0
>
>
> Sometimes TestFastbinRoundTrip still fails with these exceptions being shown:
> [https://gist.github.com/cschneider/2e342a72112597dab55c01d65a9f654d]
> ConnectException 
> [https://gist.github.com/cschneider/48b8b72bf972e4da0a01021341fa5bfe]
>  



--
This message was sent by Atlassian Jira
(v8.3.4#803005)